BDBM50114048 CHEMBL3605410
SMILES Nc1cc(Br)ccc1C(=O)NC1(CCCCC1)C(=O)NCC#N
InChI Key InChIKey=KVQZUZVIKTWMTQ-UHFFFAOYSA-N
Data  2 KI
PDB links: 1 PDB ID matches this monomer.
  Tab Delimited (TSV)   2D SDfile   Computed 3D by Vconf -m prep SDfile
Find this compound or compounds like it in BindingDB:
Activity Spreadsheet -- Enzyme Inhibition Constant Data from BindingDB
Found 2 hits for monomerid = 50114048
TargetCathepsin K(Homo sapiens (Human))
National Institute Of Chemistry
Curated by ChEMBL
LigandPNGBDBM50114048(CHEMBL3605410)
Affinity DataKi:  10nM. Assay description: Inhibition of human cathepsin-K using Z-Gly-Pro-Arg-AMC as substrate preincubated for 30 mins measured after 10 mins by fluorescence assay
TargetProcathepsin L(Homo sapiens (Human))
National Institute Of Chemistry
Curated by ChEMBL
LigandPNGBDBM50114048(CHEMBL3605410)
Affinity DataKi:  1.10E+4nM. Assay description: Inhibition of human cathepsin-L using Z-Phe-Arg-AMC as substrate preincubated for 30 mins measured after 10 mins by fluorescence assay
In DepthDetails ArticlePubMed