BDBM50115 3-hydroxy-N-[[5-[4-(2-pyrimidinylsulfamoyl)phenyl]-2-furanyl]methylideneamino]-2-naphthalenecarboxamide::3-hydroxy-N-[[5-[4-(2-pyrimidylsulfamoyl)phenyl]-2-furyl]methyleneamino]-2-naphthamide::3-hydroxy-N-[[5-[4-(pyrimidin-2-ylsulfamoyl)phenyl]furan-2-yl]methylideneamino]naphthalene-2-carboxamide::3-oxidanyl-N-[[5-[4-(pyrimidin-2-ylsulfamoyl)phenyl]furan-2-yl]methylideneamino]naphthalene-2-carboxamide::MLS000565900::SMR000153004::cid_2101123
SMILES Oc1cc2ccccc2cc1C(=O)NN=Cc1ccc(o1)-c1ccc(cc1)S(=O)(=O)Nc1ncccn1
InChI Key InChIKey=RUMPAMJMDBPTGC-UHFFFAOYSA-N
Data  6 IC50  1 EC50
  Tab Delimited (TSV)   2D SDfile   Computed 3D by Vconf -m prep SDfile
Find this compound or compounds like it in BindingDB:
Activity Spreadsheet -- Enzyme Inhibition Constant Data from BindingDB
Found 7 hits for monomerid = 50115
TargetInduced myeloid leukemia cell differentiation protein Mcl-1(Homo sapiens (Human))
Emory University
Curated by PubChem BioAssay
LigandPNGBDBM50115(3-hydroxy-N-[[5-[4-(2-pyrimidinylsulfamoyl)phenyl]...)
Affinity DataIC50:  1.63E+3nM. Assay description: NIH Molecular Libraries Screening Centers Network [MLSCN] Emory Chemical Biology Discovery Center in MLSCN Assay provider: Nikolovska-Coleska, Univer...
In DepthDetails PCBioAssay
TargetSUMO-conjugating enzyme UBC9(Homo sapiens (Human))
Burnham Center For Chemical Genomics
Curated by PubChem BioAssay
LigandPNGBDBM50115(3-hydroxy-N-[[5-[4-(2-pyrimidinylsulfamoyl)phenyl]...)
Affinity DataIC50:  2.21E+3nM. Assay description: Data Source: Sanford-Burnham Center for Chemical Genomics (SBCCG) Source Affiliation: Sanford-Burnham Medical Research Institute (SBMRI, San Diego, C...
In DepthDetails PCBioAssay
TargetM1 family aminopeptidase(Plasmodium falciparum (isolate FcB1 / Columbia))
Srmlsc
Curated by PubChem BioAssay
LigandPNGBDBM50115(3-hydroxy-N-[[5-[4-(2-pyrimidinylsulfamoyl)phenyl]...)
Affinity DataIC50:  4.23E+4nM. Assay description: Southern Research Molecular Libraries Screening Center (SRMLSC) Southern Research Institute (Birmingham, Alabama) NIH Molecular Libraries Screening...
In DepthDetails PCBioAssay
TargetBcl-2-like protein 1(Homo sapiens (Human))
The Scripps Research Institute Molecular Screening Center
Curated by PubChem BioAssay
LigandPNGBDBM50115(3-hydroxy-N-[[5-[4-(2-pyrimidinylsulfamoyl)phenyl]...)
Affinity DataIC50:  1.09E+5nM. Assay description: Source (MLPCN Center Name): The Scripps Research Institute Molecular Screening Center Affiliation: The Scripps Research Institute, TSRI Assay Provide...
In DepthDetails PCBioAssay
TargetLarge T antigen(Simian virus 40)
Southern Research Specialized Biocontainment Screening Center
Curated by PubChem BioAssay
LigandPNGBDBM50115(3-hydroxy-N-[[5-[4-(2-pyrimidinylsulfamoyl)phenyl]...)
Affinity DataEC50: >5.00E+4nM. Assay description: Southern Research's Specialized Biocontainment Screening Center (SRSBSC) Southern Research Institute (Birmingham, Alabama) NIH Molecular Librarie...
In DepthDetails PCBioAssay
TargetInduced myeloid leukemia cell differentiation protein Mcl-1(Homo sapiens (Human))
Emory University
Curated by PubChem BioAssay
LigandPNGBDBM50115(3-hydroxy-N-[[5-[4-(2-pyrimidinylsulfamoyl)phenyl]...)
Affinity DataIC50: >4.03E+3nM. Assay description: Source (MLPCN Center Name): The Scripps Research Institute Molecular Screening Center Affiliation: The Scripps Research Institute, TSRI Assay Provide...
In DepthDetails PCBioAssay
TargetSUMO-activating enzyme subunit 1(Homo sapiens (Human))
Burnham Center For Chemical Genomics
Curated by PubChem BioAssay
LigandPNGBDBM50115(3-hydroxy-N-[[5-[4-(2-pyrimidinylsulfamoyl)phenyl]...)
Affinity DataIC50:  1.24E+4nM. Assay description: Data Source: Sanford-Burnham Center for Chemical Genomics (SBCCG) Source Affiliation: Sanford-Burnham Medical Research Institute (SBMRI, San Diego, C...
In DepthDetails PCBioAssay