BDBM50120223 4-[5-(8-Cyclohexyl-2,6-dioxo-1-propyl-1,2,6,7-tetrahydro-purin-3-yl)-pentanoyl]-benzenesulfonyl fluoride::CHEMBL108552
SMILES CCCn1c(=O)n(CCCCC(=O)c2ccc(cc2)S(F)(=O)=O)c2nc([nH]c2c1=O)C1CCCCC1
InChI Key InChIKey=AHPJUSSESRHGJN-UHFFFAOYSA-N
Data  1 IC50  2 Kd
  Tab Delimited (TSV)   2D SDfile   Computed 3D by Vconf -m prep SDfile
Find this compound or compounds like it in BindingDB:
Activity Spreadsheet -- Enzyme Inhibition Constant Data from BindingDB
Found 3 hits for monomerid = 50120223
TargetAdenosine receptor A1(Homo sapiens (Human))
Monash University (Parkville Campus)
Curated by ChEMBL
LigandPNGBDBM50120223(4-[5-(8-Cyclohexyl-2,6-dioxo-1-propyl-1,2,6,7-tetr...)
Affinity DataKd:  0.400nM. Assay description: Equilibrium dissociation constant for [3H]-DPCPX binding to Adenosine A1 receptor from DDT1 MF2 cell membranes
In DepthDetails ArticlePubMed
TargetAdenosine receptor A1(Homo sapiens (Human))
Monash University (Parkville Campus)
Curated by ChEMBL
LigandPNGBDBM50120223(4-[5-(8-Cyclohexyl-2,6-dioxo-1-propyl-1,2,6,7-tetr...)
Affinity DataIC50:  17nM. Assay description: Inhibitory concentration against [3H]-DPCPX binding to Adenosine A1 recepto from DDT1 MF2 cells
In DepthDetails ArticlePubMed
TargetAdenosine receptor A1(Homo sapiens (Human))
Monash University (Parkville Campus)
Curated by ChEMBL
LigandPNGBDBM50120223(4-[5-(8-Cyclohexyl-2,6-dioxo-1-propyl-1,2,6,7-tetr...)
Affinity DataKd:  0.400nM. Assay description: Inhibitory concentration against [3H]-DPCPX binding to Adenosine A1 recepto from DDT1 MF2 cells
In DepthDetails ArticlePubMed