BDBM50120441 1-[2-(2-Hydroxy-ethyl)-piperidin-1-yl]-3-(2-phenyl-3,3a-dihydro-pyrazolo[1,5-a]pyridin-4-yl)-propenone::CHEMBL144740
SMILES OCC[C@@H]1CCCCN1C(=O)C=CC1=CC=CN2N=C(CC12)c1ccccc1
InChI Key InChIKey=VYLXLPRFXILGDM-AIBWNMTMSA-N
Data  1 KI
  Tab Delimited (TSV)   2D SDfile   Computed 3D by Vconf -m prep SDfile
Find this compound or compounds like it in BindingDB:
Activity Spreadsheet -- Enzyme Inhibition Constant Data from BindingDB
Found 1 hit for monomerid = 50120441
TargetAdenosine receptor A1(BOVINE)
Universit£
Curated by ChEMBL
LigandPNGBDBM50120441(1-[2-(2-Hydroxy-ethyl)-piperidin-1-yl]-3-(2-phenyl...)
Affinity DataKi:  0.490nM. Assay description: Binding affinity at bovine Adenosine A1 receptor.
In DepthDetails ArticlePubMed