BDBM50120826 CHEMBL1510984
SMILES COc1cccc(NC(=N)Nc2nc(O)cc(CSc3ccccn3)n2)c1
InChI Key InChIKey=SNHFBKIAFQMJCQ-UHFFFAOYSA-N
Data  1 IC50
  Tab Delimited (TSV)   2D SDfile   Computed 3D by Vconf -m prep SDfile
Find this compound or compounds like it in BindingDB:
Activity Spreadsheet -- Enzyme Inhibition Constant Data from BindingDB
Found 1 hit for monomerid = 50120826
TargetAlpha-amylase 1A(Homo sapiens (Human))
Freie Universit£T Berlin
Curated by ChEMBL
LigandPNGBDBM50120826(CHEMBL1510984)
Affinity DataIC50:  3.30E+5nM. Assay description: Inhibition of human salivary alpha-amylase using GalG2CNP as substrate by UV-Vis spectrophotometric analysis
In DepthDetails ArticlePubMed