BDBM50120837 CHEMBL3618484
SMILES CC(=O)N1CCN(CC1)C1=NC(=O)\C(S1)=C/c1ccccc1O
InChI Key InChIKey=KGIUTIANTQIKIP-GXDHUFHOSA-N
Data  1 IC50
  Tab Delimited (TSV)   2D SDfile   Computed 3D by Vconf -m prep SDfile
Find this compound or compounds like it in BindingDB:
Activity Spreadsheet -- Enzyme Inhibition Constant Data from BindingDB
Found 1 hit for monomerid = 50120837
TargetAlpha-amylase 1A(Homo sapiens (Human))
Freie Universit£T Berlin
Curated by ChEMBL
LigandPNGBDBM50120837(CHEMBL3618484)
Affinity DataIC50:  7.00E+5nM. Assay description: Inhibition of human salivary alpha-amylase using GalG2CNP as substrate by UV-Vis spectrophotometric analysis
In DepthDetails ArticlePubMed