BDBM50122047 CHEMBL157388::N-{2-[4-(3-Chloro-phenyl)-piperazin-1-yl]-ethyl}-3-methoxy-benzamide
SMILES COc1cccc(c1)C(=O)NCCN1CCN(CC1)c1cccc(Cl)c1
InChI Key InChIKey=YJEZRUGENOMVCI-UHFFFAOYSA-N
Data  4 KI
  Tab Delimited (TSV)   2D SDfile   Computed 3D by Vconf -m prep SDfile
Find this compound or compounds like it in BindingDB:
Activity Spreadsheet -- Enzyme Inhibition Constant Data from BindingDB
Found 4 hits for monomerid = 50122047
TargetD(4) dopamine receptor(Homo sapiens (Human))
Universit£
Curated by ChEMBL
LigandPNGBDBM50122047(CHEMBL157388 | N-{2-[4-(3-Chloro-phenyl)-piperazin...)
Affinity DataKi:  0.260nM. Assay description: Binding affinity towards human Dopamine receptor D4 using [3H]spiroperidol as radioligand
In DepthDetails ArticlePubMed
Target5-hydroxytryptamine receptor 1A(Rattus norvegicus (rat))
Universit£
Curated by ChEMBL
LigandPNGBDBM50122047(CHEMBL157388 | N-{2-[4-(3-Chloro-phenyl)-piperazin...)
Affinity DataKi:  35nM. Assay description: Binding affinity towards 5-hydroxytryptamine 1A receptor from rat hippocampal membranes
In DepthDetails ArticlePubMed
TargetD(3) dopamine receptor(Rattus norvegicus (Rat))
Universit£
Curated by ChEMBL
LigandPNGBDBM50122047(CHEMBL157388 | N-{2-[4-(3-Chloro-phenyl)-piperazin...)
Affinity DataKi:  472nM. Assay description: Binding affinity towards Dopamine receptor D3 of rat using [3H]spiroperidol as radioligand
In DepthDetails ArticlePubMed
TargetD(2) dopamine receptor(Homo sapiens (Human))
Universit£
Curated by ChEMBL
LigandPNGBDBM50122047(CHEMBL157388 | N-{2-[4-(3-Chloro-phenyl)-piperazin...)
Affinity DataKi: >1.00E+3nM. Assay description: Binding affinity towards human Dopamine receptor D2 using [3H]spiroperidol as radioligand
In DepthDetails ArticlePubMed