BDBM50122442 CHEMBL3622456
SMILES COc1cc2nc(nc(N)c2cc1OC)N1CCOCC1
InChI Key InChIKey=AYYMBIHIBAOSFY-UHFFFAOYSA-N
Data  1 IC50
  Tab Delimited (TSV)   2D SDfile   Computed 3D by Vconf -m prep SDfile
Find this compound or compounds like it in BindingDB:
Activity Spreadsheet -- Enzyme Inhibition Constant Data from BindingDB
Found 1 hit for monomerid = 50122442
TargetPolymerase acidic protein(Influenza A virus (strain A/X-31 H3N2))
Universit£
Curated by ChEMBL
LigandPNGBDBM50122442(CHEMBL3622456)
Affinity DataIC50: >5.00E+5nM. Assay description: Inhibition of recombinant Influenza virus A/X-31 N-terminal RdRp PA subunit (1 to 217) expressed in Escherichia coli using single-stranded circular D...
In DepthDetails ArticlePubMed