BDBM50122443 CHEMBL3622457
SMILES Oc1cc2cc([nH]c2cc1O)C(=O)NCCCNC(=O)c1cc2ccccc2[nH]1
InChI Key InChIKey=JQEVTTXWULEQMN-UHFFFAOYSA-N
Data  1 IC50
  Tab Delimited (TSV)   2D SDfile   Computed 3D by Vconf -m prep SDfile
Find this compound or compounds like it in BindingDB:
Activity Spreadsheet -- Enzyme Inhibition Constant Data from BindingDB
Found 1 hit for monomerid = 50122443
TargetPolymerase acidic protein(Influenza A virus (strain A/X-31 H3N2))
Universit£
Curated by ChEMBL
LigandPNGBDBM50122443(CHEMBL3622457)
Affinity DataIC50:  6.50E+4nM. Assay description: Inhibition of recombinant Influenza virus A/X-31 N-terminal RdRp PA subunit (1 to 217) expressed in Escherichia coli using single-stranded circular D...
In DepthDetails ArticlePubMed