BDBM50122456 CHEMBL3622487
SMILES CCN(C(=O)c1ccc(CNc2nc(NC3CCCCC3)nc(n2)N2CCc3cc(OC)c(OC)cc3C2)cc1)c1cccc(C)c1
InChI Key InChIKey=JNTRDWXGTHRFEO-UHFFFAOYSA-N
Data  1 IC50
  Tab Delimited (TSV)   2D SDfile   Computed 3D by Vconf -m prep SDfile
Find this compound or compounds like it in BindingDB:
Activity Spreadsheet -- Enzyme Inhibition Constant Data from BindingDB
Found 1 hit for monomerid = 50122456
TargetA disintegrin and metalloproteinase with thrombospondin motifs 4(Homo sapiens (Human))
Glaxosmithkline
Curated by ChEMBL
LigandPNGBDBM50122456(CHEMBL3622487)
Affinity DataIC50:  284nM. Assay description: Inhibition of recombinant human ADAMTS4 (213 to 575 amino acid residues) using WAAG-3R as substrate preincubated for 15 mins followed by substrate ad...
In DepthDetails ArticlePubMed