BDBM50123930 CHEMBL3621759
SMILES O[C@@H](CCCCCCCC(=O)c1c(O)cc(O)cc1O)c1ccccc1
InChI Key InChIKey=JLDJEUAXJKQYEX-KRWDZBQOSA-N
Data  4 KI  2 IC50
  Tab Delimited (TSV)   2D SDfile   Computed 3D by Vconf -m prep SDfile
Find this compound or compounds like it in BindingDB:
Activity Spreadsheet -- Enzyme Inhibition Constant Data from BindingDB
Found 6 hits for monomerid = 50123930
TargetLysosomal alpha-glucosidase(Rattus norvegicus)
Chulalongkorn University
Curated by ChEMBL
LigandPNGBDBM50123930(CHEMBL3621759)
Affinity DataKi:  4.80E+5nM. Assay description: Non-competitive inhibition of rat intestinal Maltase using maltose as substrate assessed as glucose release after 10 mins by Lineweaver-Burk plot ana...
In DepthDetails ArticlePubMed
TargetSucrase-isomaltase, intestinal(Rattus norvegicus (Rat))
Chulalongkorn University
Curated by ChEMBL
LigandPNGBDBM50123930(CHEMBL3621759)
Affinity DataKi:  5.40E+5nM. Assay description: Non-competitive inhibition of rat intestinal Sucrase using sucrose as substrate assessed as glucose release after 40 mins by Lineweaver-Burk plot ana...
In DepthDetails ArticlePubMed
TargetSucrase-isomaltase, intestinal(Rattus norvegicus (Rat))
Chulalongkorn University
Curated by ChEMBL
LigandPNGBDBM50123930(CHEMBL3621759)
Affinity DataKi:  1.09E+6nM. Assay description: Competitive inhibition of rat intestinal Sucrase using sucrose as substrate assessed as glucose release after 40 mins by Lineweaver-Burk plot analysi...
In DepthDetails ArticlePubMed
TargetLysosomal alpha-glucosidase(Rattus norvegicus)
Chulalongkorn University
Curated by ChEMBL
LigandPNGBDBM50123930(CHEMBL3621759)
Affinity DataKi:  1.64E+6nM. Assay description: Competitive inhibition of rat intestinal Maltase using maltose as substrate assessed as glucose release after 10 mins by Lineweaver-Burk plot analysi...
In DepthDetails ArticlePubMed
TargetSucrase-isomaltase, intestinal(Rattus norvegicus (Rat))
Chulalongkorn University
Curated by ChEMBL
LigandPNGBDBM50123930(CHEMBL3621759)
Affinity DataIC50:  9.49E+4nM. Assay description: Inhibition of rat intestinal Sucrase using sucrose as substrate assessed as glucose release after 40 mins by glucose oxidase method
In DepthDetails ArticlePubMed
TargetLysosomal alpha-glucosidase(Rattus norvegicus)
Chulalongkorn University
Curated by ChEMBL
LigandPNGBDBM50123930(CHEMBL3621759)
Affinity DataIC50:  4.72E+4nM. Assay description: Inhibition of rat intestinal Maltase using maltose as substrate assessed as glucose release after 10 mins by glucose oxidase method
In DepthDetails ArticlePubMed