BDBM50124573 CHEMBL1472460
SMILES NCC(=O)Nc1cccc(c1)-c1nn2c(nc(cc2=O)N2CCNCC2)s1
InChI Key InChIKey=ITNCYPYTFKVCFI-UHFFFAOYSA-N
Data  3 IC50
PDB links: 1 PDB ID matches this monomer.
  Tab Delimited (TSV)   2D SDfile   Computed 3D by Vconf -m prep SDfile
Find this compound or compounds like it in BindingDB:
Activity Spreadsheet -- Enzyme Inhibition Constant Data from BindingDB
Found 3 hits for monomerid = 50124573
TargetIntegrin alpha-2/beta-3(Homo sapiens (Human))
A.V. Bogatsky Physico-Chemical Institute Of The National Academy Of Sciences Of Ukraine
Curated by ChEMBL
LigandPNGBDBM50124573(CHEMBL1472460)
Affinity DataIC50:  96nM. Assay description: Antagonist activity against integrin alpha2bbeta3 in human platelet rich plasma
TargetIntegrin alpha-IIb/beta-3(Homo sapiens (Human))
Bristol-Myers Squibb Research And Development
Curated by ChEMBL
LigandPNGBDBM50124573(CHEMBL1472460)
Affinity DataIC50:  96nM. Assay description: Antagonist activity at integrin alpha2b beta3 receptor in citrated human platelet-rich plasma assessed as inhibition of ADP-induced platelets aggrega...
TargetIntegrin alpha-IIb/beta-3(Homo sapiens (Human))
Bristol-Myers Squibb Research And Development
Curated by ChEMBL
LigandPNGBDBM50124573(CHEMBL1472460)
Affinity DataIC50:  95nM. Assay description: Antagonist activity at integrin alpha2b beta3 receptor in citrated human platelet-rich plasma assessed as inhibition of ADP-induced platelet aggregat...