BDBM50125304 (S)-2-((S)-7,7-Dimethyl-2-oxo-bicyclo[2.2.1]hept-1-ylmethanesulfonylamino)-3-[3'-(3-propyl-ureido)-biphenyl-4-yl]-propionic acid::CHEMBL10737
SMILES CCCNC(=O)Nc1cccc(c1)-c1ccc(C[C@H](NS(=O)(=O)C[C@]23CCC(CC2=O)C3(C)C)C(O)=O)cc1
InChI Key InChIKey=CNNXQMKKHGGQNP-SOABOUKKSA-N
Data  1 KI
  Tab Delimited (TSV)   2D SDfile   Computed 3D by Vconf -m prep SDfile
Find this compound or compounds like it in BindingDB:
Activity Spreadsheet -- Enzyme Inhibition Constant Data from BindingDB
Found 1 hit for monomerid = 50125304
TargetIntegrin alpha-V/beta-3(Homo sapiens (Human))
Bayer
Curated by ChEMBL
LigandPNGBDBM50125304((S)-2-((S)-7,7-Dimethyl-2-oxo-bicyclo[2.2.1]hept-1...)
Affinity DataKi:  1nM. Assay description: Binding affinity towards vitronectin receptor (alpha V-beta3) was determined
In DepthDetails ArticlePubMed