BDBM50131439 CHEMBL3632778
SMILES CC(C)(C)c1nc(-c2cccs2)c2c(N)c(C#N)c(N)nc2n1
InChI Key InChIKey=IEOHKMKJPWZXAU-UHFFFAOYSA-N
Data  1 IC50
  Tab Delimited (TSV)   2D SDfile   Computed 3D by Vconf -m prep SDfile
Find this compound or compounds like it in BindingDB:
Activity Spreadsheet -- Enzyme Inhibition Constant Data from BindingDB
Found 1 hit for monomerid = 50131439
TargetDNA ligase(Staphylococcus aureus)
Astrazeneca
Curated by ChEMBL
LigandPNGBDBM50131439(CHEMBL3632778)
Affinity DataIC50:  160nM. Assay description: Inhibition of Staphylococcus aureus NAD(+)-dependent DNA ligase
In DepthDetails ArticlePubMed