BDBM50133458 4-[3-((R)-1-Methyl-pyrrolidin-2-ylmethyl)-1H-indol-5-yl]-3,6-dihydro-2H-pyridine-1-carbothioic acid phenylamide::CHEMBL334259
SMILES CN1CCC[C@@H]1Cc1c[nH]c2ccc(cc12)C1=CCN(CC1)C(=S)Nc1ccccc1
InChI Key InChIKey=KIZFBOUMJTUKDH-HSZRJFAPSA-N
Data  2 KI
  Tab Delimited (TSV)   2D SDfile   Computed 3D by Vconf -m prep SDfile
Find this compound or compounds like it in BindingDB:
Activity Spreadsheet -- Enzyme Inhibition Constant Data from BindingDB
Found 2 hits for monomerid = 50133458
Target5-hydroxytryptamine receptor 1D(Homo sapiens (Human))
Nps Pharmaceuticals
Curated by ChEMBL
LigandPNGBDBM50133458(4-[3-((R)-1-Methyl-pyrrolidin-2-ylmethyl)-1H-indol...)
Affinity DataKi:  0.680nM. Assay description: Binding affinity towards cloned human 5-hydroxytryptamine 1D receptor
In DepthDetails ArticlePubMed
Target5-hydroxytryptamine receptor 1B(Homo sapiens (Human))
Nps Pharmaceuticals
Curated by ChEMBL
LigandPNGBDBM50133458(4-[3-((R)-1-Methyl-pyrrolidin-2-ylmethyl)-1H-indol...)
Affinity DataKi:  5.80nM. Assay description: Binding affinity towards cloned human 5-hydroxytryptamine 1B receptor
In DepthDetails ArticlePubMed