BDBM50133622 5-Chloro-1-(4-chloro-benzyl)-1H-indole-2,3-dione::CHEMBL333067
SMILES Clc1ccc(CN2C(=O)C(=O)c3cc(Cl)ccc23)cc1
InChI Key InChIKey=NWUYWKYKVCEBTP-UHFFFAOYSA-N
Data  2 IC50
  Tab Delimited (TSV)   2D SDfile   Computed 3D by Vconf -m prep SDfile
Find this compound or compounds like it in BindingDB:
Activity Spreadsheet -- Enzyme Inhibition Constant Data from BindingDB
Found 2 hits for monomerid = 50133622
TargetCruzipain(Trypanosoma cruzi)
University Of Cape Town
Curated by ChEMBL
LigandPNGBDBM50133622(5-Chloro-1-(4-chloro-benzyl)-1H-indole-2,3-dione |...)
Affinity DataIC50:  6.00E+3nM. Assay description: Inhibitory activity against the Trypanosoma cruzi cysteine protease cruzain
In DepthDetails ArticlePubMed
TargetFalcipain 2(Plasmodium falciparum)
University Of Cape Town
Curated by ChEMBL
LigandPNGBDBM50133622(5-Chloro-1-(4-chloro-benzyl)-1H-indole-2,3-dione |...)
Affinity DataIC50:  3.12E+4nM. Assay description: Inhibitory activity was tested against Falcipain-2
In DepthDetails ArticlePubMed