BDBM50133632 1-(3-Methoxy-benzyl)-5-methyl-1H-indole-2,3-dione::1-(3-methoxybenzyl)-5-methylindoline-2,3-dione::CHEMBL324722
SMILES COc1cccc(CN2C(=O)C(=O)c3cc(C)ccc23)c1
InChI Key InChIKey=ZSPZSZMUOMBLFZ-UHFFFAOYSA-N
Data  2 IC50
  Tab Delimited (TSV)   2D SDfile   Computed 3D by Vconf -m prep SDfile
Find this compound or compounds like it in BindingDB:
Activity Spreadsheet -- Enzyme Inhibition Constant Data from BindingDB
Found 2 hits for monomerid = 50133632
TargetCruzipain(Trypanosoma cruzi)
University Of Cape Town
Curated by ChEMBL
LigandPNGBDBM50133632(1-(3-Methoxy-benzyl)-5-methyl-1H-indole-2,3-dione ...)
Affinity DataIC50:  2.00E+3nM. Assay description: Inhibitory activity against the Trypanosoma cruzi cysteine protease cruzain
In DepthDetails ArticlePubMed
TargetFalcipain 2(Plasmodium falciparum)
University Of Cape Town
Curated by ChEMBL
LigandPNGBDBM50133632(1-(3-Methoxy-benzyl)-5-methyl-1H-indole-2,3-dione ...)
Affinity DataIC50:  2.19E+4nM. Assay description: Inhibitory activity was tested against Falcipain-2
In DepthDetails ArticlePubMed