BDBM50134028 CHEMBL142036::N,N'-(9-(4-aminophenylamino)acridine-2,7-diyl)bis(3-(pyrrolidin-1-yl)propanamide)::N-[9-(4-Amino-phenylamino)-7-(3-pyrrolidin-1-yl-propionylamino)-acridin-2-yl]-3-pyrrolidin-1-yl-propionamide
SMILES Nc1ccc(Nc2c3cc(NC(=O)CCN4CCCC4)ccc3nc3ccc(NC(=O)CCN4CCCC4)cc23)cc1
InChI Key InChIKey=YQJVVNZTCPSKPO-UHFFFAOYSA-N
Data  1 IC50  1 EC50
  Tab Delimited (TSV)   2D SDfile   Computed 3D by Vconf -m prep SDfile
Find this compound or compounds like it in BindingDB:
Activity Spreadsheet -- Enzyme Inhibition Constant Data from BindingDB
Found 2 hits for monomerid = 50134028
TargetTelomerase reverse transcriptase(Homo sapiens (Human))
Central University Of Las Villas
Curated by ChEMBL
LigandPNGBDBM50134028(CHEMBL142036 | N,N'-(9-(4-aminophenylamino)acridin...)
Affinity DataIC50:  200nM. Assay description: Inhibition of telomerase in human A2780 cells by TRAP assay
In DepthDetails ArticlePubMed
TargetTelomerase reverse transcriptase(Homo sapiens (Human))
Central University Of Las Villas
Curated by ChEMBL
LigandPNGBDBM50134028(CHEMBL142036 | N,N'-(9-(4-aminophenylamino)acridin...)
Affinity DataEC50:  200nM. Assay description: Inhibitory activity against human telomerase
In DepthDetails ArticlePubMed