BDBM50136 MLS000574934::SMR000156298::cid_11957301
SMILES [H][C@]12Cc3cc(O)c(OC)cc3-c3c4OCOc4cc(CCN1)c23
InChI Key InChIKey=VYJUHRAQPIBWNV-GFCCVEGCSA-N
Data  1 IC50  1 EC50
  Tab Delimited (TSV)   2D SDfile   Computed 3D by Vconf -m prep SDfile
Find this compound or compounds like it in BindingDB:
Activity Spreadsheet -- Enzyme Inhibition Constant Data from BindingDB
Found 2 hits for monomerid = 50136
TargetGlycogen synthase kinase-3 beta(Homo sapiens (Human))
Broad Institute
Curated by PubChem BioAssay
LigandPNGBDBM50136(MLS000574934 | SMR000156298 | cid_11957301)
Affinity DataEC50:  1.63E+4nM. Assay description: Keywords: GSK3beta, dose response, kinase, inhibition, HTS Assay Overview: The glycogen synthase kinase-3 beta (GSK-3b) is a known master regulator f...
In DepthDetails PCBioAssay
TargetInduced myeloid leukemia cell differentiation protein Mcl-1(Homo sapiens (Human))
Emory University
Curated by PubChem BioAssay
LigandPNGBDBM50136(MLS000574934 | SMR000156298 | cid_11957301)
Affinity DataIC50:  5.61E+3nM. Assay description: NIH Molecular Libraries Screening Centers Network [MLSCN] Emory Chemical Biology Discovery Center in MLSCN Assay provider: Nikolovska-Coleska, Univer...
In DepthDetails PCBioAssay