BDBM50136916 3'-Chloro-4'-fluoro-biphenyl-3-sulfonic acid (3-chloro-7-isobutylamino-1H-indazol-5-yl)-amide::CHEMBL349317
SMILES CC(C)CNc1cc(NS(=O)(=O)c2cccc(c2)-c2ccc(F)c(Cl)c2)cc2c(Cl)[nH]nc12
InChI Key InChIKey=KMRSSRLEQPRRBB-UHFFFAOYSA-N
Data  1 KI
  Tab Delimited (TSV)   2D SDfile   Computed 3D by Vconf -m prep SDfile
Find this compound or compounds like it in BindingDB:
Activity Spreadsheet -- Enzyme Inhibition Constant Data from BindingDB
Found 1 hit for monomerid = 50136916
Target5'-methylthioadenosine/S-adenosylhomocysteine nucleosidase(Escherichia coli (strain K12))
Quorex Pharmaceuticals
Curated by ChEMBL
LigandPNGBDBM50136916(3'-Chloro-4'-fluoro-biphenyl-3-sulfonic acid (3-ch...)
Affinity DataKi:  3.40nM. Assay description: Inhibition of Escherichia coli S-adenosyl homocysteine/methylthioadenosine nucleosidase (MTA/SAH nucleosidase)
In DepthDetails ArticlePubMed