BDBM50136937 5-Dimethylamino-naphthalene-1-sulfonic acid (1H-indazol-6-yl)-amide::CHEMBL152983
SMILES CN(C)c1cccc2c(cccc12)S(=O)(=O)Nc1ccc2c[nH]nc2c1
InChI Key InChIKey=XTRGAMHQUWDIHG-UHFFFAOYSA-N
Data  1 KI
  Tab Delimited (TSV)   2D SDfile   Computed 3D by Vconf -m prep SDfile
Find this compound or compounds like it in BindingDB:
Activity Spreadsheet -- Enzyme Inhibition Constant Data from BindingDB
Found 1 hit for monomerid = 50136937
Target5'-methylthioadenosine/S-adenosylhomocysteine nucleosidase(Escherichia coli (strain K12))
Quorex Pharmaceuticals
Curated by ChEMBL
LigandPNGBDBM50136937(5-Dimethylamino-naphthalene-1-sulfonic acid (1H-in...)
Affinity DataKi:  1.00E+3nM. Assay description: Inhibition of Escherichia coli S-adenosyl homocysteine/methylthioadenosine nucleosidase (MTA/SAH nucleosidase)
In DepthDetails ArticlePubMed