BDBM50137 MLS000560945::N-[[(E)-3-(2-furyl)-1-methyl-prop-2-enylidene]amino]-2-(2-thienyl)acetamide::N-[[(E)-4-(2-furanyl)but-3-en-2-ylidene]amino]-2-thiophen-2-ylacetamide::N-[[(E)-4-(furan-2-yl)but-3-en-2-ylidene]amino]-2-thiophen-2-yl-ethanamide::N-[[(E)-4-(furan-2-yl)but-3-en-2-ylidene]amino]-2-thiophen-2-ylacetamide::SMR000175287::Thiophen-2-yl-acetic acid (3-furan-2-yl-1-methyl-allylidene)-hydrazide::cid_739483
SMILES CC(C=Cc1ccco1)=NNC(=O)Cc1cccs1
InChI Key InChIKey=WWZGIVAVMKNQTL-UHFFFAOYSA-N
Data  5 IC50
  Tab Delimited (TSV)   2D SDfile   Computed 3D by Vconf -m prep SDfile
Find this compound or compounds like it in BindingDB:
Activity Spreadsheet -- Enzyme Inhibition Constant Data from BindingDB
Found 5 hits for monomerid = 50137
TargetInduced myeloid leukemia cell differentiation protein Mcl-1(Homo sapiens (Human))
Emory University
Curated by PubChem BioAssay
LigandPNGBDBM50137(MLS000560945 | N-[[(E)-3-(2-furyl)-1-methyl-prop-2...)
Affinity DataIC50:  4.15E+3nM. Assay description: NIH Molecular Libraries Screening Centers Network [MLSCN] Emory Chemical Biology Discovery Center in MLSCN Assay provider: Nikolovska-Coleska, Univer...
In DepthDetails PCBioAssay
TargetAmyloid-beta A4 precursor protein-binding family A member 1(Rattus norvegicus)
Burnham Center For Chemical Genomics
Curated by PubChem BioAssay
LigandPNGBDBM50137(MLS000560945 | N-[[(E)-3-(2-furyl)-1-methyl-prop-2...)
Affinity DataIC50:  2.46E+4nM. Assay description: Data Source: Sanford-Burnham Center for Chemical Genomics (SBCCG) Source Affiliation: Sanford-Burnham Medical Research Institute (SBMRI, San Diego, C...
In DepthDetails PCBioAssay
TargetEukaryotic translation initiation factor 4H(Homo sapiens (Human))
Burnham Center For Chemical Genomics
Curated by PubChem BioAssay
LigandPNGBDBM50137(MLS000560945 | N-[[(E)-3-(2-furyl)-1-methyl-prop-2...)
Affinity DataIC50:  2.36E+4nM. Assay description: Data Source: Sanford-Burnham Center for Chemical Genomics (SBCCG) Source Affiliation: Sanford-Burnham Medical Research Institute (SBMRI, San Diego, C...
In DepthDetails PCBioAssay
TargetVoltage-dependent N-type calcium channel subunit alpha-1B(Homo sapiens (Human))
Burnham Center For Chemical Genomics
Curated by PubChem BioAssay
LigandPNGBDBM50137(MLS000560945 | N-[[(E)-3-(2-furyl)-1-methyl-prop-2...)
Affinity DataIC50:  1.89E+4nM. Assay description: Data Source: Data Source: Sanford-Burnham Center for Chemical Genomics (SBCCG) Source Affiliation: Sanford-Burnham Medical Research Institute Network...
In DepthDetails PCBioAssay
TargetPolyadenylate-binding protein 1(Homo sapiens (Human))
Burnham Center For Chemical Genomics
Curated by PubChem BioAssay
LigandPNGBDBM50137(MLS000560945 | N-[[(E)-3-(2-furyl)-1-methyl-prop-2...)
Affinity DataIC50:  1.00E+5nM. Assay description: Data Source: Sanford-Burnham Center for Chemical Genomics (SBCCG) Source Affiliation: Sanford-Burnham Medical Research Institute (SBMRI, San Diego, C...
In DepthDetails PCBioAssay