BDBM50139710 4-Nitro-3-phenyl-5-trifluoromethyl-1H-pyrazole::CHEMBL167508
SMILES [O-][N+](=O)c1c(n[nH]c1C(F)(F)F)-c1ccccc1
InChI Key InChIKey=FAHRYEXMSLOYOP-UHFFFAOYSA-N
Data  1 EC50
  Tab Delimited (TSV)   2D SDfile   Computed 3D by Vconf -m prep SDfile
Find this compound or compounds like it in BindingDB:
Activity Spreadsheet -- Enzyme Inhibition Constant Data from BindingDB
Found 1 hit for monomerid = 50139710
LigandPNGBDBM50139710(4-Nitro-3-phenyl-5-trifluoromethyl-1H-pyrazole | C...)
Affinity DataEC50:  3.00E+4nM. Assay description: Maximum activation of human KATP (SUR1/Kir6.2) channel expressed in Xenopus oocytes
In DepthDetails ArticlePubMed