BDBM50139941 1-[5-((1E,3E)-4-Hydroxyamino-buta-1,3-dienyl)-1-methyl-1H-pyrrol-3-yl]-2-phenyl-ethanone::CHEMBL13196
SMILES Cn1cc(cc1C=CCCN=O)C(=O)Cc1ccccc1
InChI Key InChIKey=VZNXTJITBRATQL-UHFFFAOYSA-N
Data  2 IC50
  Tab Delimited (TSV)   2D SDfile   Computed 3D by Vconf -m prep SDfile
Find this compound or compounds like it in BindingDB:
Activity Spreadsheet -- Enzyme Inhibition Constant Data from BindingDB
Found 2 hits for monomerid = 50139941
TargetHistone deacetylase 2b(Zea mays)
Sapienza University Of Rome
Curated by ChEMBL
LigandPNGBDBM50139941(1-[5-((1E,3E)-4-Hydroxyamino-buta-1,3-dienyl)-1-me...)
Affinity DataIC50:  1.48E+3nM. Assay description: Concentration required for inhibition of histone deacetylase HD2 in vitro.Checked by Author
In DepthDetails ArticlePubMed
TargetHistone deacetylase 2b(Zea mays)
Sapienza University Of Rome
Curated by ChEMBL
LigandPNGBDBM50139941(1-[5-((1E,3E)-4-Hydroxyamino-buta-1,3-dienyl)-1-me...)
Affinity DataIC50:  1.48E+3nM. Assay description: Concentration required for inhibition of histone deacetylase HD2 in vitro.Checked by Author
In DepthDetails ArticlePubMed