BDBM50142907 CHEMBL3759259
SMILES CCC(=O)N1CCC(CN2CC[C@H](NC(=O)c3cc(Cl)c(N)cc3OC)[C@@H](C2)OC)CC1
InChI Key InChIKey=SJZHMGAZAINZPT-PZJWPPBQSA-N
Data  2 IC50  1 EC50
  Tab Delimited (TSV)   2D SDfile   Computed 3D by Vconf -m prep SDfile
Find this compound or compounds like it in BindingDB:
Activity Spreadsheet -- Enzyme Inhibition Constant Data from BindingDB
Found 3 hits for monomerid = 50142907
TargetPotassium voltage-gated channel subfamily H member 2(Homo sapiens (Human))
Sungkyunkwan University
Curated by ChEMBL
LigandPNGBDBM50142907(CHEMBL3759259)
Affinity DataIC50: >1.00E+4nM. Assay description: Inhibition of human ERG channel by fluorescence polarization assay
In DepthDetails ArticlePubMed
Target5-hydroxytryptamine receptor 4(Homo sapiens (Human))
Sungkyunkwan University
Curated by ChEMBL
LigandPNGBDBM50142907(CHEMBL3759259)
Affinity DataIC50:  329nM. Assay description: Displacement of [3H]-GR113808 from human 5-HT4 receptor expressed in African green monkey COS7 cell membranes after 30 mins by liquid scintillation c...
In DepthDetails ArticlePubMed
Target5-hydroxytryptamine receptor 4(RAT)
Sungkyunkwan University
Curated by ChEMBL
LigandPNGBDBM50142907(CHEMBL3759259)
Affinity DataEC50:  380nM. Assay description: Agonist activity at 5-HT4 receptor in rat esophageal thoracic muscularis mucosae assessed as carbachol-induced contraction
In DepthDetails ArticlePubMed