BDBM50143418 7-Hydroxy-8-(2-hydroxy-4-sulfo-naphthalen-1-ylazo)-naphthalene-1,3,6-trisulfonic acid::CHEMBL368082
SMILES Oc1cc(c2ccccc2c1N=Nc1c(O)c(cc2cc(cc(c12)S([O-])(=O)=O)S([O-])(=O)=O)S([O-])(=O)=O)S([O-])(=O)=O
InChI Key InChIKey=CUZBFLNQSMIQBG-UHFFFAOYSA-J
Data  2 IC50
  Tab Delimited (TSV)   2D SDfile   Computed 3D by Vconf -m prep SDfile
Find this compound or compounds like it in BindingDB:
Activity Spreadsheet -- Enzyme Inhibition Constant Data from BindingDB
Found 2 hits for monomerid = 50143418
TargetTyrosine-protein phosphatase 1(Saccharomyces cerevisiae)
Inha University
Curated by ChEMBL
LigandPNGBDBM50143418(7-Hydroxy-8-(2-hydroxy-4-sulfo-naphthalen-1-ylazo)...)
Affinity DataIC50:  1.10E+5nM. Assay description: Inhibitory activity against Saccharomyces cerevisiae Tyrosine phosphatase 1
In DepthDetails ArticlePubMed
TargetTyrosine-protein phosphatase non-receptor type 1(Homo sapiens (Human))
Inha University
Curated by ChEMBL
LigandPNGBDBM50143418(7-Hydroxy-8-(2-hydroxy-4-sulfo-naphthalen-1-ylazo)...)
Affinity DataIC50:  4.60E+5nM. Assay description: Inhibition of human PTPase 1B
In DepthDetails ArticlePubMed