BDBM50144002 3-{4-[2-(4-tert-Butyl-phenyl)-2-(2',4'-dichloro-biphenyl-4-ylcarbamoyl)-ethyl]-benzoylamino}-propionic acid::CHEMBL62123
SMILES CC(C)(C)c1ccc(cc1)C(Cc1ccc(cc1)C(=O)NCCC(O)=O)C(=O)Nc1ccc(cc1)-c1ccc(Cl)cc1Cl
InChI Key InChIKey=DCXARCKEWAQLJB-UHFFFAOYSA-N
Data  2 KI
  Tab Delimited (TSV)   2D SDfile   Computed 3D by Vconf -m prep SDfile
Find this compound or compounds like it in BindingDB:
Activity Spreadsheet -- Enzyme Inhibition Constant Data from BindingDB
Found 2 hits for monomerid = 50144002
TargetGlucagon receptor(Homo sapiens (Human))
Abbott Laboratories
Curated by ChEMBL
LigandPNGBDBM50144002(3-{4-[2-(4-tert-Butyl-phenyl)-2-(2',4'-dichloro-bi...)
Affinity DataKi:  6nM. Assay description: In vitro binding affinity against human glucagon receptor (h-GlucR) was determined
In DepthDetails ArticlePubMed
TargetAdenylate cyclase type 1/2/3/4/5/6/7/8/9(Homo sapiens (Human))
Abbott Laboratories
Curated by ChEMBL
LigandPNGBDBM50144002(3-{4-[2-(4-tert-Butyl-phenyl)-2-(2',4'-dichloro-bi...)
Affinity DataKi:  33nM. Assay description: In vitro inhibitory activity against glucagon induced human adenylate cyclase
In DepthDetails ArticlePubMed