BDBM50144694 CHEMBL307716::N*4*-(4-Chloro-phenyl)-6-(2,5-dichloro-phenyl)-pyrimidine-2,4-diamine
SMILES Nc1nc(Nc2ccc(Cl)cc2)cc(n1)-c1cc(Cl)ccc1Cl
InChI Key InChIKey=MWQCKNWBCFBOGD-UHFFFAOYSA-N
Data  1 IC50
  Tab Delimited (TSV)   2D SDfile   Computed 3D by Vconf -m prep SDfile
Find this compound or compounds like it in BindingDB:
Activity Spreadsheet -- Enzyme Inhibition Constant Data from BindingDB
Found 1 hit for monomerid = 50144694
Target1-acyl-sn-glycerol-3-phosphate acyltransferase beta(Homo sapiens (Human))
Cell Therapeutics
Curated by ChEMBL
LigandPNGBDBM50144694(CHEMBL307716 | N*4*-(4-Chloro-phenyl)-6-(2,5-dichl...)
Affinity DataIC50:  20nM. Assay description: Inhibitory activity against Lysophosphatidic acid acyltransferase-beta expressed in Sf9 insect cell membranes
In DepthDetails ArticlePubMed