BDBM50145616 CHEMBL3763331
SMILES Cl.Fc1ccc(cc1)C(N1CCN(CCCNC(=O)c2ccncc2)CC1)c1ccc(F)cc1
InChI Key InChIKey=NWVQWEATHIBBPB-UHFFFAOYSA-N
Data  5 KI
  Tab Delimited (TSV)   2D SDfile   Computed 3D by Vconf -m prep SDfile
Find this compound or compounds like it in BindingDB:
Activity Spreadsheet -- Enzyme Inhibition Constant Data from BindingDB
Found 5 hits for monomerid = 50145616
TargetD(1A) dopamine receptor(RAT)
Dipartimento Di Farmacia Universit£
Curated by ChEMBL
LigandPNGBDBM50145616(CHEMBL3763331)
Affinity DataKi:  0.0983nM. Assay description: Displacement of [3H]SCH-23390 from dopamine D1 receptor in rat striatum incubated for 15 mins by liquid scintillation counting analysis
In DepthDetails ArticlePubMed
Target5-hydroxytryptamine receptor 1A(Rattus norvegicus (rat))
Dipartimento Di Farmacia Universit£
Curated by ChEMBL
LigandPNGBDBM50145616(CHEMBL3763331)
Affinity DataKi:  0.130nM. Assay description: Displacement of [3H]8-OH-DPAT from 5HT1A receptor in Sprague-Dawley rat brain cortex incubated for 30 mins by liquid scintillation counting analysis
In DepthDetails ArticlePubMed
TargetD(2) dopamine receptor(Rattus norvegicus (rat))
Dipartimento Di Farmacia Universit£
Curated by ChEMBL
LigandPNGBDBM50145616(CHEMBL3763331)
Affinity DataKi:  27nM. Assay description: Displacement of [3H]spiperone from dopamine D2 receptor in rat striatum incubated for 15 mins by liquid scintillation counting analysis
In DepthDetails ArticlePubMed
Target5-hydroxytryptamine receptor 2A(Rattus norvegicus (rat))
Dipartimento Di Farmacia Universit£
Curated by ChEMBL
LigandPNGBDBM50145616(CHEMBL3763331)
Affinity DataKi: >1.00E+4nM. Assay description: Displacement of [3H]ketanserin from 5HT2A receptor in Sprague-Dawley rat brain cortex incubated for 15 mins by liquid scintillation counting analysis
In DepthDetails ArticlePubMed
Target5-hydroxytryptamine receptor 2C(Rattus norvegicus (Rat))
Dipartimento Di Farmacia Universit£
Curated by ChEMBL
LigandPNGBDBM50145616(CHEMBL3763331)
Affinity DataKi: >1.00E+4nM. Assay description: Displacement of [3H]mesulergine from 5HT2C receptor in Sprague-Dawley rat brain cortex incubated for 15 mins by liquid scintillation counting analysi...
In DepthDetails ArticlePubMed