BDBM50146416 (S)-2-[(S)-2-[(S)-2-(5-Hydroxy-4-oxo-4H-pyran-2-ylmethoxycarbonylamino)-1-oxo-3-phenyl-propylamino]-3-(1H-indol-3-yl)-propionylamino]-3-(4-hydroxy-phenyl)-propionic acid::CHEMBL317040
SMILES OC(=O)[C@H](Cc1ccc(O)cc1)NC(=O)[C@H](Cc1c[nH]c2ccccc12)NC(=O)[C@H](Cc1ccccc1)NC(=O)OCc1cc(=O)c(O)co1
InChI Key InChIKey=AOMOJQKAHRHJLR-DTXPUJKBSA-N
Data  1 IC50
  Tab Delimited (TSV)   2D SDfile   Computed 3D by Vconf -m prep SDfile
Find this compound or compounds like it in BindingDB:
Activity Spreadsheet -- Enzyme Inhibition Constant Data from BindingDB
Found 1 hit for monomerid = 50146416
TargetTyrosinase(Homo sapiens (Human))
Seoul National University
Curated by ChEMBL
LigandPNGBDBM50146416((S)-2-[(S)-2-[(S)-2-(5-Hydroxy-4-oxo-4H-pyran-2-yl...)
Affinity DataIC50:  240nM. Assay description: Inhibitory activity against mushroom tyrosinase
In DepthDetails ArticlePubMed