BDBM50147617 CHEMBL3765421
SMILES OC(=O)CN(C1(CCC1)c1ccc(cc1)-c1ccc(Cl)cc1Cl)S(=O)(=O)c1ccc(OC(F)F)cc1
InChI Key InChIKey=VHGKQLHJJUPOCF-UHFFFAOYSA-N
Data  3 IC50
  Tab Delimited (TSV)   2D SDfile   Computed 3D by Vconf -m prep SDfile
Find this compound or compounds like it in BindingDB:
Activity Spreadsheet -- Enzyme Inhibition Constant Data from BindingDB
Found 3 hits for monomerid = 50147617
TargetDiacylglycerol lipase-beta(Homo sapiens (Human))
Bristol-Myers Squibb
Curated by ChEMBL
LigandPNGBDBM50147617(CHEMBL3765421)
Affinity DataIC50:  146nM. Assay description: Inhibition of DAGLbeta (unknown origin)
In DepthDetails ArticlePubMed
TargetDiacylglycerol lipase-alpha(Homo sapiens (Human))
Bristol-Myers Squibb
Curated by ChEMBL
LigandPNGBDBM50147617(CHEMBL3765421)
Affinity DataIC50:  88nM. Assay description: Inhibition of full length human C-terminal HA-tagged DAGLalpha expressed in HEK293 cells using DAG as substrate assessed as reduction in intracellula...
In DepthDetails ArticlePubMed
TargetDiacylglycerol lipase-alpha(Homo sapiens (Human))
Bristol-Myers Squibb
Curated by ChEMBL
LigandPNGBDBM50147617(CHEMBL3765421)
Affinity DataIC50:  88nM. Assay description: Inhibition of full length human C-terminal HA-tagged DAGLalpha expressed in HEK293 cells using DAG as substrate assessed as reduction in intracellula...
In DepthDetails ArticlePubMed