BDBM50149487 (2S,3R)-2-{4-[2-(3-Aza-bicyclo[3.2.0]hept-3-yl)-ethoxy]-phenyl}-3-(4-hydroxy-phenyl)-2,3-dihydro-benzo[1,4]oxathiin-6-ol::CHEMBL184598
SMILES Oc1ccc(cc1)[C@H]1Sc2cc(O)ccc2O[C@H]1c1ccc(OCCN2CC3CCC3C2)cc1
InChI Key InChIKey=LCRLCVCOQDLILD-QZQYRZTLSA-N
Data  2 IC50
  Tab Delimited (TSV)   2D SDfile   Computed 3D by Vconf -m prep SDfile
Find this compound or compounds like it in BindingDB:
Activity Spreadsheet -- Enzyme Inhibition Constant Data from BindingDB
Found 2 hits for monomerid = 50149487
TargetEstrogen receptor(Homo sapiens (Human))
Merck Research Laboratories
Curated by ChEMBL
LigandPNGBDBM50149487((2S,3R)-2-{4-[2-(3-Aza-bicyclo[3.2.0]hept-3-yl)-et...)
Affinity DataIC50:  0.800nM. Assay description: Binding potency for human ER alpha
In DepthDetails ArticlePubMed
TargetEstrogen receptor beta(Homo sapiens (Human))
Merck Research Laboratories
Curated by ChEMBL
LigandPNGBDBM50149487((2S,3R)-2-{4-[2-(3-Aza-bicyclo[3.2.0]hept-3-yl)-et...)
Affinity DataIC50:  85nM. Assay description: Binding potency for human ER beta
In DepthDetails ArticlePubMed