BDBM50150110 CHEMBL3771098
SMILES O=C(Cc1ccccc1)Nc1nnc(N[C@H]2CCN(C2)c2nnc(NC(=O)Cc3ccccc3)s2)s1
InChI Key InChIKey=XKAUHJUBYCZSGD-SFHVURJKSA-N
Data  1 IC50
PDB links: 1 PDB ID matches this monomer.
  Tab Delimited (TSV)   2D SDfile   Computed 3D by Vconf -m prep SDfile
Find this compound or compounds like it in BindingDB:
Activity Spreadsheet -- Enzyme Inhibition Constant Data from BindingDB
Found 1 hit for monomerid = 50150110
TargetGlutaminase kidney isoform, mitochondrial(Homo sapiens (Human))
University Of Pittsburgh
Curated by ChEMBL
LigandPNGBDBM50150110(CHEMBL3771098)
Affinity DataIC50:  70nM. Assay description: Inhibition of recombinant HIs-tagged human GAC (residue 72-603 aa) expressed in Escherichia coli after 10 mins using glutamine as substrate