BDBM50150121 CHEMBL3770977
SMILES [H][C@@]12CCC[C@]1([H])N1C(=N2)N(C)C(=O)c2c(Oc3ccc(F)cc3)n(Cc3ccc(cc3)-c3cccc(F)n3)nc12
InChI Key InChIKey=CYDWGGROPDQYNW-PKTZIBPZSA-N
Data  1 KI
  Tab Delimited (TSV)   2D SDfile   Computed 3D by Vconf -m prep SDfile
Find this compound or compounds like it in BindingDB:
Activity Spreadsheet -- Enzyme Inhibition Constant Data from BindingDB
Found 1 hit for monomerid = 50150121
TargetcAMP-specific 3',5'-cyclic phosphodiesterase 4A(Homo sapiens (Human))
Intra-Cellular Therapies
Curated by ChEMBL
LigandPNGBDBM50150121(CHEMBL3770977)
Affinity DataKi:  220nM. Assay description: Inhibition of recombinant full lenght human PDE4A using fluorescent labeled cAMP as substrate after 15 mins by IMAP assay
In DepthDetails ArticlePubMed