BDBM50150277 CHEMBL3769495
SMILES [H][C@@]12CCC[C@]1([H])N1C(=N2)N(C)C(=O)c2c1nn(Cc1ccc(cc1)-c1cccc(F)n1)c2N(C)c1ccccc1
InChI Key InChIKey=PDQXUZVSAWDXMU-RPWUZVMVSA-N
Data  1 KI
  Tab Delimited (TSV)   2D SDfile   Computed 3D by Vconf -m prep SDfile
Find this compound or compounds like it in BindingDB:
Activity Spreadsheet -- Enzyme Inhibition Constant Data from BindingDB
Found 1 hit for monomerid = 50150277
TargetcAMP-specific 3',5'-cyclic phosphodiesterase 4A(Homo sapiens (Human))
Intra-Cellular Therapies
Curated by ChEMBL
LigandPNGBDBM50150277(CHEMBL3769495)
Affinity DataKi:  740nM. Assay description: Inhibition of recombinant full lenght human PDE4A using fluorescent labeled cAMP as substrate after 15 mins by IMAP assay
In DepthDetails ArticlePubMed