BDBM50150374 2-[(2-Bromo-6-methoxy-5-trifluoromethyl-naphthalene-1-carbonyl)-amino]-pentanedioic acid::CHEMBL184072
SMILES COc1ccc2c(C(=O)NC(CCC(O)=O)C(O)=O)c(Br)ccc2c1C(F)(F)F
InChI Key InChIKey=RYWCZYUPVZVLMV-UHFFFAOYSA-N
Data  1 IC50
  Tab Delimited (TSV)   2D SDfile   Computed 3D by Vconf -m prep SDfile
Find this compound or compounds like it in BindingDB:
Activity Spreadsheet -- Enzyme Inhibition Constant Data from BindingDB
Found 1 hit for monomerid = 50150374
TargetRNA-directed RNA polymerase(Hepatitis C virus)
Wyeth Research
Curated by ChEMBL
LigandPNGBDBM50150374(2-[(2-Bromo-6-methoxy-5-trifluoromethyl-naphthalen...)
Affinity DataIC50:  120nM. Assay description: Inhibitory concentration against HCV NS5B RNA dependent RNA polymerase
In DepthDetails ArticlePubMed