BDBM50150381 2-[(2-Fluoro-6-methoxy-5-trifluoromethyl-naphthalene-1-carbonyl)-amino]-succinic acid::CHEMBL185249
SMILES COc1ccc2c(C(=O)NC(CC(O)=O)C(O)=O)c(F)ccc2c1C(F)(F)F
InChI Key InChIKey=QNZOSBJTDFIBJB-UHFFFAOYSA-N
Data  1 IC50
  Tab Delimited (TSV)   2D SDfile   Computed 3D by Vconf -m prep SDfile
Find this compound or compounds like it in BindingDB:
Activity Spreadsheet -- Enzyme Inhibition Constant Data from BindingDB
Found 1 hit for monomerid = 50150381
TargetRNA-directed RNA polymerase(Hepatitis C virus)
Wyeth Research
Curated by ChEMBL
LigandPNGBDBM50150381(2-[(2-Fluoro-6-methoxy-5-trifluoromethyl-naphthale...)
Affinity DataIC50:  2.10E+3nM. Assay description: Inhibitory concentration against HCV NS5B RNA dependent RNA polymerase
In DepthDetails ArticlePubMed