BDBM50150384 CHEMBL184977::{[2-(4-Chloro-phenyl)-6-methoxy-5-trifluoromethyl-naphthalene-1-carbonyl]-methoxycarbonyl-amino}-acetic acid
SMILES COC(=O)N(CC(O)=O)C(=O)c1c(ccc2c(c(OC)ccc12)C(F)(F)F)-c1ccc(Cl)cc1
InChI Key InChIKey=FNQAGEUIONIXMD-UHFFFAOYSA-N
Data  1 IC50
  Tab Delimited (TSV)   2D SDfile   Computed 3D by Vconf -m prep SDfile
Find this compound or compounds like it in BindingDB:
Activity Spreadsheet -- Enzyme Inhibition Constant Data from BindingDB
Found 1 hit for monomerid = 50150384
TargetRNA-directed RNA polymerase(Hepatitis C virus)
Wyeth Research
Curated by ChEMBL
LigandPNGBDBM50150384(CHEMBL184977 | {[2-(4-Chloro-phenyl)-6-methoxy-5-t...)
Affinity DataIC50: >2.00E+4nM. Assay description: Inhibitory concentration against HCV NS5B RNA dependent RNA polymerase
In DepthDetails ArticlePubMed