BDBM50150417 CHEMBL182322::N-[2-(4-Fluoro-phenoxy)-ethyl]-N''-[1-(4-fluoro-phenyl)-ethyl]-[1,3,5]triazine-2,4,6-triamine
SMILES CC(Nc1nc(N)nc(NCCOc2ccc(F)cc2)n1)c1ccc(F)cc1
InChI Key InChIKey=UNUSDSJWMRJMCT-UHFFFAOYSA-N
Data  3 KI
  Tab Delimited (TSV)   2D SDfile   Computed 3D by Vconf -m prep SDfile
Find this compound or compounds like it in BindingDB:
Activity Spreadsheet -- Enzyme Inhibition Constant Data from BindingDB
Found 3 hits for monomerid = 50150417
Target5-hydroxytryptamine receptor 7(Homo sapiens (Human))
Normandie Univ
Curated by ChEMBL
LigandPNGBDBM50150417(CHEMBL182322 | N-[2-(4-Fluoro-phenoxy)-ethyl]-N''-...)
Affinity DataKi:  2nM. Assay description: Antagonist activity at 5-HT7 receptor (unknown origin)
In DepthDetails ArticlePubMed
Target5-hydroxytryptamine receptor 7(Homo sapiens (Human))
Normandie Univ
Curated by ChEMBL
LigandPNGBDBM50150417(CHEMBL182322 | N-[2-(4-Fluoro-phenoxy)-ethyl]-N''-...)
Affinity DataKi:  5nM. Assay description: Binding affinity against 5-Hydroxy tryptamine 7 receptor
In DepthDetails ArticlePubMed
Target5-hydroxytryptamine receptor 1A(Homo sapiens (Human))
Normandie Univ
Curated by ChEMBL
LigandPNGBDBM50150417(CHEMBL182322 | N-[2-(4-Fluoro-phenoxy)-ethyl]-N''-...)
Affinity DataKi: >100nM. Assay description: Antagonist activity at 5-HT1A receptor (unknown origin)
In DepthDetails ArticlePubMed