BDBM50150422 CHEMBL185384::N*2*-Phenethyl-N*4*-((S)-1-phenyl-ethyl)-pyrimidine-2,4-diamine
SMILES C[C@H](Nc1ccnc(NCCc2ccccc2)n1)c1ccccc1
InChI Key InChIKey=QBWWZCYASYKGBX-INIZCTEOSA-N
Data  1 KI
  Tab Delimited (TSV)   2D SDfile   Computed 3D by Vconf -m prep SDfile
Find this compound or compounds like it in BindingDB:
Activity Spreadsheet -- Enzyme Inhibition Constant Data from BindingDB
Found 1 hit for monomerid = 50150422
Target5-hydroxytryptamine receptor 7(Homo sapiens (Human))
Bristol-Myers Squibb Pharmaceutical Research Institute
Curated by ChEMBL
LigandPNGBDBM50150422(CHEMBL185384 | N*2*-Phenethyl-N*4*-((S)-1-phenyl-e...)
Affinity DataKi:  0.600nM. Assay description: Binding affinity against 5-Hydroxy tryptamine 7 receptor
In DepthDetails ArticlePubMed