BDBM50151932 3-[4-(4-Phenyl-piperazin-1-yl)-butyl]-1H-indole-5-carboxylic acid amide::CHEMBL365716
SMILES NC(=O)c1ccc2[nH]cc(CCCCN3CCN(CC3)c3ccccc3)c2c1
InChI Key InChIKey=RAUAAMMVLJHXCC-UHFFFAOYSA-N
Data  2 IC50
  Tab Delimited (TSV)   2D SDfile   Computed 3D by Vconf -m prep SDfile
Find this compound or compounds like it in BindingDB:
Activity Spreadsheet -- Enzyme Inhibition Constant Data from BindingDB
Found 2 hits for monomerid = 50151932
Target5-hydroxytryptamine receptor 1A(Rattus norvegicus (rat))
Merck
Curated by ChEMBL
LigandPNGBDBM50151932(3-[4-(4-Phenyl-piperazin-1-yl)-butyl]-1H-indole-5-...)
Affinity DataIC50:  0.100nM. Assay description: Inhibition of 8-OH DPAT bindign to rat hydroxytryptamine 1A receptor expressed in CHO cells
In DepthDetails ArticlePubMed
TargetD(2) dopamine receptor(Rattus norvegicus (rat))
Merck
Curated by ChEMBL
LigandPNGBDBM50151932(3-[4-(4-Phenyl-piperazin-1-yl)-butyl]-1H-indole-5-...)
Affinity DataIC50:  7nM. Assay description: Displacement of [3H]-spiperone from dopamine D2 receptor of rat striatal membranes
In DepthDetails ArticlePubMed