BDBM50154215 Bis-(4-chloro-benzyl)-(1H-tetrazol-5-yl)-amine::CHEMBL186174::N,N-BIS(4-CHLOROBENZYL)-1H-1,2,3,4-TETRAAZOL-5-AMINE::cid_447980
SMILES Clc1ccc(CN(Cc2ccc(Cl)cc2)c2nnn[nH]2)cc1
InChI Key InChIKey=UOUXILZUBDIWQU-UHFFFAOYSA-N
Data  2 IC50
  Tab Delimited (TSV)   2D SDfile   Computed 3D by Vconf -m prep SDfile
Find this compound or compounds like it in BindingDB:
Activity Spreadsheet -- Enzyme Inhibition Constant Data from BindingDB
Found 2 hits for monomerid = 50154215
TargetAldo-keto reductase family 1 member B1(Sus scrofa)
University Of California San Francisco
Curated by ChEMBL
LigandPNGBDBM50154215(Bis-(4-chloro-benzyl)-(1H-tetrazol-5-yl)-amine | C...)
Affinity DataIC50:  3.36E+5nM. Assay description: Inhibition of aldose reductase from pig lenses
In DepthDetails ArticlePubMed
TargetNeuropeptides B/W receptor type 1(Homo sapiens (Human))
The Scripps Research Institute Molecular Screening Center
Curated by PubChem BioAssay
LigandPNGBDBM50154215(Bis-(4-chloro-benzyl)-(1H-tetrazol-5-yl)-amine | C...)
Affinity DataIC50:  1.46E+4nM. Assay description: Source (MLPCN Center Name): The Scripps Research Institute Molecular Screening Center (SRIMSC) Affiliation: The Scripps Research Institute, TSRI Assa...
In DepthDetails PCBioAssay