BDBM50161151 4-(aminomethyl)-5-[methyl(propyl)-lambda~5~-azanyl]-N-propylpyridin-3-amine dihydrochloride::CHEMBL537406
SMILES CCCNc1cncc(N(C)CCC)c1CN
InChI Key InChIKey=DDCUEBYJBWDGDD-UHFFFAOYSA-N
Data  4 IC50
  Tab Delimited (TSV)   2D SDfile   Computed 3D by Vconf -m prep SDfile
Find this compound or compounds like it in BindingDB:
Activity Spreadsheet -- Enzyme Inhibition Constant Data from BindingDB
Found 4 hits for monomerid = 50161151
TargetMembrane primary amine oxidase(Homo sapiens (Human))
Universit£
Curated by ChEMBL
LigandPNGBDBM50161151(4-(aminomethyl)-5-[methyl(propyl)-lambda~5~-azanyl...)
Affinity DataIC50:  3.50E+5nM. Assay description: Inhibition of benzylamine binding to Benzylamine oxidase of porcine serum
In DepthDetails ArticlePubMed
TargetAmiloride-sensitive amine oxidase [copper-containing](Homo sapiens (Human))
Universit£
Curated by ChEMBL
LigandPNGBDBM50161151(4-(aminomethyl)-5-[methyl(propyl)-lambda~5~-azanyl...)
Affinity DataIC50:  1.00E+4nM. Assay description: Inhibition of putrescine binding to against Diamine oxidase of porcine kidney
In DepthDetails ArticlePubMed
TargetAmine oxidase [flavin-containing] B(Rattus norvegicus (rat))
Universit£
Curated by ChEMBL
LigandPNGBDBM50161151(4-(aminomethyl)-5-[methyl(propyl)-lambda~5~-azanyl...)
Affinity DataIC50:  2.00E+4nM. Assay description: Inhibitory concentration for rat liver Monoamine oxidase B using beta-phenylethylamine
In DepthDetails ArticlePubMed
TargetAmine oxidase [flavin-containing] A(Rattus norvegicus (rat))
Universit£
Curated by ChEMBL
LigandPNGBDBM50161151(4-(aminomethyl)-5-[methyl(propyl)-lambda~5~-azanyl...)
Affinity DataIC50:  1.00E+4nM. Assay description: Inhibitory concentration for rat liver Monoamine oxidase A using 5-hydroxytryptamine
In DepthDetails ArticlePubMed