BDBM50161235 CHEMBL179351::N-{4-[4-(2,3-Dichloro-phenyl)-piperazin-1-yl]-but-2-enyl}-4-(1H-imidazol-2-yl)-benzamide
SMILES Clc1cccc(N2CCN(C\C=C\CNC(=O)c3ccc(cc3)-c3ncc[nH]3)CC2)c1Cl
InChI Key InChIKey=DEHCRGUCEKMKFX-OWOJBTEDSA-N
Data  2 KI
  Tab Delimited (TSV)   2D SDfile   Computed 3D by Vconf -m prep SDfile
Find this compound or compounds like it in BindingDB:
Activity Spreadsheet -- Enzyme Inhibition Constant Data from BindingDB
Found 2 hits for monomerid = 50161235
TargetD(3) dopamine receptor(Homo sapiens (Human))
National Institute On Drug Abuse-Intramural Research Program
Curated by ChEMBL
LigandPNGBDBM50161235(CHEMBL179351 | N-{4-[4-(2,3-Dichloro-phenyl)-piper...)
Affinity DataKi:  0.300nM. Assay description: Binding affinity for human dopamine D3 receptor
In DepthDetails ArticlePubMed
TargetD(2) dopamine receptor(Homo sapiens (Human))
National Institute On Drug Abuse-Intramural Research Program
Curated by ChEMBL
LigandPNGBDBM50161235(CHEMBL179351 | N-{4-[4-(2,3-Dichloro-phenyl)-piper...)
Affinity DataKi:  8nM. Assay description: Binding affinity for human dopamine D2 receptor
In DepthDetails ArticlePubMed