BDBM50162495 CHEMBL3792472
SMILES OC(=O)Cc1noc2ccccc12
InChI Key InChIKey=BVSIAYQIMUUCRW-UHFFFAOYSA-N
Data  1 IC50
PDB links: 4 PDB IDs match this monomer.
  Tab Delimited (TSV)   2D SDfile   Computed 3D by Vconf -m prep SDfile
Find this compound or compounds like it in BindingDB:
Activity Spreadsheet -- Enzyme Inhibition Constant Data from BindingDB
Found 1 hit for monomerid = 50162495
TargetBranched-chain-amino-acid aminotransferase, mitochondrial(Homo sapiens (Human))
Glaxosmithkline
Curated by ChEMBL
LigandPNGBDBM50162495(CHEMBL3792472)
Affinity DataIC50: <1.26E+6nM. Assay description: Inhibition of human BCATm incubated for 10 mins by Amplex red- based fluorescence analysis