BDBM50167083 CHEMBL3800482
SMILES Oc1cn(ccc1=O)-c1cc(ccn1)-c1cccc(n1)C(F)(F)F
InChI Key InChIKey=WWKARKUYQXYXAW-UHFFFAOYSA-N
Data  2 IC50
  Tab Delimited (TSV)   2D SDfile   Computed 3D by Vconf -m prep SDfile
Find this compound or compounds like it in BindingDB:
Activity Spreadsheet -- Enzyme Inhibition Constant Data from BindingDB
Found 2 hits for monomerid = 50167083
TargetCatechol O-methyltransferase(Rattus norvegicus (Rat))
Merck
Curated by ChEMBL
LigandPNGBDBM50167083(CHEMBL3800482)
Affinity DataIC50:  11nM. Assay description: Inhibition of recombinant rat C-terminal His10-tagged MB-COMT transfected in Escherichia coli BL21-CodonPlus(DE3)-RIPL using SAM/dopamine as substrat...
In DepthDetails ArticlePubMed
TargetLanosterol synthase(Rattus norvegicus)
Merck
Curated by ChEMBL
LigandPNGBDBM50167083(CHEMBL3800482)
Affinity DataIC50:  84nM. Assay description: Inhibition of recombinant human C-terminal His6-tagged MB-COMT expressed in Bacmid using SAM/dopamine as substrate preincubated for 2 hrs followed by...
In DepthDetails ArticlePubMed