BDBM50169086 CHEMBL3804918
SMILES CCN(CC)c1ccc2cc(C(=O)NCCCCN3CCC(CC3)Nc3nc4ccccc4n3Cc3ccc(F)cc3)c(=O)oc2c1
InChI Key InChIKey=FUCOYJUYPRXNIH-UHFFFAOYSA-N
Data  1 KI  1 IC50
  Tab Delimited (TSV)   2D SDfile   Computed 3D by Vconf -m prep SDfile
Find this compound or compounds like it in BindingDB:
Activity Spreadsheet -- Enzyme Inhibition Constant Data from BindingDB
Found 2 hits for monomerid = 50169086
TargetPotassium voltage-gated channel subfamily H member 2(Homo sapiens (Human))
Shandong University
Curated by ChEMBL
LigandPNGBDBM50169086(CHEMBL3804918)
Affinity DataKi:  217nM. Assay description: Displacement of [3H] dofetilide from human ERG channel expressed in HEK293 cell membranes incubated for 2 hrs by scintillation counting analysis
In DepthDetails ArticlePubMed
TargetPotassium voltage-gated channel subfamily H member 2(Homo sapiens (Human))
Shandong University
Curated by ChEMBL
LigandPNGBDBM50169086(CHEMBL3804918)
Affinity DataIC50:  434nM. Assay description: Displacement of [3H] dofetilide from human ERG channel expressed in HEK293 cell membranes incubated for 2 hrs by scintillation counting analysis
In DepthDetails ArticlePubMed