BDBM50169133 CHEMBL3805506
SMILES O[C@H](CN1CC(Cc2cccc(Br)c2)(c2ccccc12)c1cccc(OC(F)(F)F)c1)C(F)(F)F
InChI Key InChIKey=HHZMLPGJLZQHHG-WTQRLHSKSA-N
Data  1 IC50
  Tab Delimited (TSV)   2D SDfile   Computed 3D by Vconf -m prep SDfile
Find this compound or compounds like it in BindingDB:
Activity Spreadsheet -- Enzyme Inhibition Constant Data from BindingDB
Found 1 hit for monomerid = 50169133
TargetCholesteryl ester transfer protein(Homo sapiens (Human))
Merck Research Laboratories
Curated by ChEMBL
LigandPNGBDBM50169133(CHEMBL3805506)
Affinity DataIC50:  308nM. Assay description: Inhibition of CETP in 95% human serum assessed as suppression of transfer of [3H]-cholesterol oleate/[3H]-triolein from LDL to HDL after 1 hr by liqu...
In DepthDetails ArticlePubMed