BDBM50170801 (1R,4R,5R)-1,4,5-Trihydroxy-3-(3-trifluoromethyl-phenyl)-cyclohex-2-enecarboxylic acid::CHEMBL189859
SMILES O[C@@H]1C[C@@](O)(C=C([C@H]1O)c1cccc(c1)C(F)(F)F)C(O)=O
InChI Key InChIKey=OPAACZWTUWGSBE-WZRBSPASSA-N
Data  1 KI
  Tab Delimited (TSV)   2D SDfile   Computed 3D by Vconf -m prep SDfile
Find this compound or compounds like it in BindingDB:
Activity Spreadsheet -- Enzyme Inhibition Constant Data from BindingDB
Found 1 hit for monomerid = 50170801
Target3-dehydroquinate dehydratase(Mycobacterium tuberculosis)
Universidad De Santiago De Compostela
Curated by ChEMBL
LigandPNGBDBM50170801((1R,4R,5R)-1,4,5-Trihydroxy-3-(3-trifluoromethyl-p...)
Affinity DataKi:  2.13E+3nMpH: 8.2Assay Description:Inhibition of Mycobacterium tuberculosis type II dehydroquinase at 25 degree C pH 8.2
In DepthDetails ArticlePubMed