BDBM50171443 2-Acetylamino-3-{4-[4-(2-acetylamino-2-carboxy-ethylsulfanylcarbonylamino)-cyclohexylmethyl]-cyclohexylcarbamoylsulfanyl}-propionic acid::CHEMBL361887
SMILES CC(=O)NC(CSC(=O)NC1CCC(CC2CCC(CC2)NC(=O)SCC(NC(C)=O)C(O)=O)CC1)C(O)=O
InChI Key InChIKey=CCJPZRPFRJEGCQ-UHFFFAOYSA-N
Data  1 IC50
  Tab Delimited (TSV)   2D SDfile   Computed 3D by Vconf -m prep SDfile
Find this compound or compounds like it in BindingDB:
Activity Spreadsheet -- Enzyme Inhibition Constant Data from BindingDB
Found 1 hit for monomerid = 50171443
TargetGlutathione reductase(Saccharomyces cerevisiae)
South Dakota State University
Curated by ChEMBL
LigandPNGBDBM50171443(2-Acetylamino-3-{4-[4-(2-acetylamino-2-carboxy-eth...)
Affinity DataIC50:  4.77E+5nMpH: 7.4Assay Description:Inhibition of yeast glutathione reductase over 30 minutes pH 7.4 at 25 degree C
In DepthDetails ArticlePubMed